Target
Solute carrier organic anion transporter family member 2B1
Ligand
BDBM50242284
Substrate
Meas. Tech.
ChEMBL_1488528 (CHEMBL3531157)
Ki
25900±n/a nM
Citation
 Gao, CZhang, HGuo, ZYou, TChen, XZhong, D Mechanistic studies on the absorption and disposition of scutellarin in humans: selective OATP2B1-mediated hepatic uptake is a likely key determinant for its unique pharmacokinetic characteristics. Drug Metab Dispos 40:2009-20 (2012)  
Target
Name:
Solute carrier organic anion transporter family member 2B1
Synonyms:
KIAA0880 OATP-RP2 OATPB Organic anion transporter B SLC21A9 SO2B1_HUMAN | Solute carrier family 21 member 9
Type:
PROTEIN
Mol. Mass.:
76729.07
Organism:
Homo sapiens (Human)
Description:
ChEMBL_1488531
Residue:
709
  
Inhibitor
Name:
BDBM50242284
Synonyms:
CHEMBL487805 | scutellarin
Type:
Small organic molecule
Emp. Form.:
C21H18O12
Mol. Mass.:
462.3604
SMILES:
O[C@H]1[C@H](Oc2cc3oc(cc(=O)c3c(O)c2O)-c2ccc(O)cc2)O[C@@H]([C@@H](O)[C@@H]1O)C(O)=O
: