Target
Sodium channel protein type 9 subunit alpha
Ligand
BDBM50088552
Substrate
Meas. Tech.
ChEMBL_1495673 (CHEMBL3578661)
IC50
970±n/a nM
Citation
 Lynch, SMTafesse, LCarlin, KGhatak, PShao, BAbdelhamid, HKyle, DJ N-Aryl azacycles as novel sodium channel blockers. Bioorg Med Chem Lett 25:48-52 (2014)  
Target
Name:
Sodium channel protein type 9 subunit alpha
Synonyms:
NENA Peripheral sodium channel 1 SCN9A_HUMAN Voltage-gated sodium channel subunit Nav1.7 hNE-Na
Type:
Protein
Mol. Mass.:
226375.97
Organism:
Homo sapiens (Human)
Description:
Q15858
Residue:
1988
  
Inhibitor
Name:
BDBM50088552
Synonyms:
CHEMBL3577029
Type:
Small organic molecule
Emp. Form.:
C24H23F3N4O3
Mol. Mass.:
472.4596
SMILES:
NC(=O)N1CCN(c2ccc(cc2)C(F)(F)F)c2ccc(cc2C1)-c1cccc(n1)[C@H](O)CO
: