Target
Sodium channel protein type 9 subunit alpha
Ligand
BDBM50088538
Substrate
Meas. Tech.
ChEMBL_1495673 (CHEMBL3578661)
IC50
>20000±n/a nM
Citation
 Lynch, SMTafesse, LCarlin, KGhatak, PShao, BAbdelhamid, HKyle, DJ N-Aryl azacycles as novel sodium channel blockers. Bioorg Med Chem Lett 25:48-52 (2014)  
Target
Name:
Sodium channel protein type 9 subunit alpha
Synonyms:
NENA Peripheral sodium channel 1 SCN9A_HUMAN Voltage-gated sodium channel subunit Nav1.7 hNE-Na
Type:
Protein
Mol. Mass.:
226375.97
Organism:
Homo sapiens (Human)
Description:
Q15858
Residue:
1988
  
Inhibitor
Name:
BDBM50088538
Synonyms:
CHEMBL3576946
Type:
Small organic molecule
Emp. Form.:
C21H16F3N3O
Mol. Mass.:
383.3664
SMILES:
NC(=O)c1cccc(n1)-c1ccc2N(CCc2c1)c1ccc(cc1)C(F)(F)F
: