Target
Amine oxidase [flavin-containing] B
Ligand
BDBM50088565
Substrate
Meas. Tech.
ChEMBL_1495690 (CHEMBL3578678)
IC50
730000±n/a nM
Citation
 El-Faham, AZainab Al Marhoon, naAbdel-Megeed, AKhattab, SNBekhit, AAAlbericio, F a-Ketoamino acid ester derivatives as promising MAO inhibitors. Bioorg Med Chem Lett 25:70-4 (2015)  
Target
Name:
Amine oxidase [flavin-containing] B
Synonyms:
AOFB_BOVIN MAO-B Monoamine Oxidase Type B (MAO-B) Monoamine oxidase B | Monoamine oxidase type B
Type:
PROTEIN
Mol. Mass.:
58428.94
Organism:
Bos taurus
Description:
ChEMBL_1501478
Residue:
520
  
Inhibitor
Name:
BDBM50088565
Synonyms:
CHEMBL3577040
Type:
Small organic molecule
Emp. Form.:
C21H21N3O6
Mol. Mass.:
411.4079
SMILES:
COC(=O)[C@H](C)NC(=O)c1ccc(NC(=O)C(=O)c2ccccc2NC(C)=O)cc1
: