Target
D(1A) dopamine receptor
Ligand
BDBM50436542
Substrate
Meas. Tech.
ChEMBL_1496586 (CHEMBL3578852)
Ki
18000±n/a nM
Citation
 Weichert, DBanerjee, AHiller, CKling, RCHübner, HGmeiner, P Molecular determinants of biased agonism at the dopamine D2 receptor. J Med Chem 58:2703-17 (2015)  
Target
Name:
D(1A) dopamine receptor
Synonyms:
DA D1 receptor DRD1 Dopamine D1 receptor Dopamine D1A
Type:
Enzyme
Mol. Mass.:
49303.43
Organism:
Homo sapiens (Human)
Description:
P21728
Residue:
446
  
Inhibitor
Name:
BDBM50436542
Synonyms:
CHEMBL2397389
Type:
Small organic molecule
Emp. Form.:
C28H34N2O
Mol. Mass.:
414.5824
SMILES:
CCCN(CCCCNC(=O)c1ccc(cc1)-c1ccccc1)[C@@H]1CCC(=CC1)C#C
: