Target
Tyrosine-protein kinase Fyn
Ligand
BDBM50343426
Substrate
Meas. Tech.
ChEMBL_1497041 (CHEMBL3580016)
Ki
8150±n/a nM
Citation
 Tintori, CLa Sala, GVignaroli, GBotta, LFallacara, ALFalchi, FRadi, MZamperini, CDreassi, EDello Iacono, LOrioli, DBiamonti, GGarbelli, MLossani, AGasparrini, FTuccinardi, TLaurenzana, IAngelucci, AMaga, GSchenone, SBrullo, CMusumeci, FDesogus, ACrespan, EBotta, M Studies on the ATP Binding Site of Fyn Kinase for the Identification of New Inhibitors and Their Evaluation as Potential Agents against Tauopathies and Tumors. J Med Chem 58:4590-609 (2015)  
Target
Name:
Tyrosine-protein kinase Fyn
Synonyms:
FYN Proto-oncogene Syn SLK Src-like kinase | p59-Fyn
Type:
Enzyme
Mol. Mass.:
60762.21
Organism:
Homo sapiens (Human)
Description:
P06241
Residue:
537
  
Inhibitor
Name:
BDBM50343426
Synonyms:
1-(2-Chloro-2-phenylethyl)-6-[(2-morpholin-4-ylethyl)thio]-N-propyl-1H-pyrazolo[3,4-d]pyrimidin-4-amine | CHEMBL1775040
Type:
Small organic molecule
Emp. Form.:
C22H29ClN6OS
Mol. Mass.:
461.023
SMILES:
CCCNc1nc(SCCN2CCOCC2)nc2n(CC(Cl)c3ccccc3)ncc12
: