Target
Glucocorticoid receptor
Ligand
BDBM50089604
Substrate
Meas. Tech.
ChEMBL_1497288 (CHEMBL3579001)
IC50
4900±n/a nM
Citation
 Yang, CBalsells, JChu, HDCox, JMCrespo, AMa, XContino, LBrown, PGao, SZamlynny, BWiltsie, JClemas, JLisnock, JGibson, JZhou, GGarcia-Calvo, MBateman, TJTong, VXu, LCrook, MSinclair, PShen, HC Discovery of benzimidazole oxazolidinediones as novel and selective nonsteroidal mineralocorticoid receptor antagonists. ACS Med Chem Lett 6:461-5 (2015)  
Target
Name:
Glucocorticoid receptor
Synonyms:
GCR_HUMAN GRL Glucocorticoid receptor (GRFP) Nuclear receptor subfamily 3 group C member 1
Type:
Enzyme
Mol. Mass.:
85656.87
Organism:
Homo sapiens (Human)
Description:
P04150
Residue:
777
  
Inhibitor
Name:
BDBM50089604
Synonyms:
CHEMBL3578285
Type:
Small organic molecule
Emp. Form.:
C29H27FN4O4
Mol. Mass.:
514.5475
SMILES:
C[C@@H](N1C(=O)O[C@@](Cc2ccccc2)(C1=O)c1nc2cc(ccc2[nH]1)N1CCOCC1)c1ccc(F)cc1
: