Target
Cannabinoid receptor 1
Ligand
BDBM50089970
Substrate
Meas. Tech.
ChEMBL_1499460 (CHEMBL3583993)
Ki
4710±n/a nM
Citation
 Harnett, JJDolo, CViossat, IAuger, FFerrandis, EBigg, DAuguet, MAuvin, SChabrier, PE Novel azoles as potent and selective cannabinoid CB2 receptor agonists. Bioorg Med Chem Lett 25:88-91 (2015)  
Target
Name:
Cannabinoid receptor 1
Synonyms:
CANN6 CB-R CNR CNR1_HUMAN Cannabinoid receptor Cannabinoid receptor 1 (brain)
Type:
G Protein-Coupled Receptor (GPCR)
Mol. Mass.:
52868.96
Organism:
Homo sapiens (Human)
Description:
P21554
Residue:
472
  
Inhibitor
Name:
BDBM50089970
Synonyms:
CHEMBL3581229
Type:
Small organic molecule
Emp. Form.:
C24H36N2OS
Mol. Mass.:
400.62
SMILES:
CN(C)C1(CCOCC1)c1nc(cs1)-c1cc(cc(c1)C(C)(C)C)C(C)(C)C
: