Target
Protein kinase C alpha type
Ligand
BDBM50090080
Substrate
Meas. Tech.
ChEMBL_1497523 (CHEMBL3582655)
Ki
14±n/a nM
Citation
 Kedei, NKraft, MBKeck, GEHerald, CLMelody, NPettit, GRBlumberg, PM Neristatin 1 provides critical insight into bryostatin 1 structure-function relationships. J Nat Prod 78:896-900 (2015)  
Target
Name:
Protein kinase C alpha type
Synonyms:
KPCA_HUMAN PKC alpha and beta-2 PKC-alpha PRKACA Protein Kinase C- alpha Protein kinase C alpha (PKCa) Protein kinase C alpha type (PRKCA) RAF proto-oncogene serine/threonine-protein kinase
Type:
Enzyme
Mol. Mass.:
76755.65
Organism:
Homo sapiens (Human)
Description:
The recombinant human PKC enzymes were produced using a baculovirus expression system in SF9 cells
Residue:
672
  
Inhibitor
Name:
BDBM50090080
Synonyms:
CHEMBL3581528
Type:
Small organic molecule
Emp. Form.:
C41H64O16
Mol. Mass.:
812.9373
SMILES:
[H][C@]12C[C@H](OC(C)=O)C(C)(C)[C@](O)(CCOC(=O)\C=C\C(C)(C)[C@]3(O)O[C@@]([H])(C\C(=C/C(=O)OC)[C@@H]3OC(=O)CCCCCCC)C[C@@H](O)[C@@H](C)OC(=O)C[C@H](O)C1)O2
: