Target
Protein kinase C alpha type
Ligand
BDBM50090081
Substrate
Meas. Tech.
ChEMBL_1497523 (CHEMBL3582655)
Ki
21±n/a nM
Citation
 Kedei, NKraft, MBKeck, GEHerald, CLMelody, NPettit, GRBlumberg, PM Neristatin 1 provides critical insight into bryostatin 1 structure-function relationships. J Nat Prod 78:896-900 (2015)  
Target
Name:
Protein kinase C alpha type
Synonyms:
KPCA_HUMAN PKC alpha and beta-2 PKC-alpha PRKACA Protein Kinase C- alpha Protein kinase C alpha (PKCa) Protein kinase C alpha type (PRKCA) RAF proto-oncogene serine/threonine-protein kinase
Type:
Enzyme
Mol. Mass.:
76755.65
Organism:
Homo sapiens (Human)
Description:
The recombinant human PKC enzymes were produced using a baculovirus expression system in SF9 cells
Residue:
672
  
Inhibitor
Name:
BDBM50090081
Synonyms:
CHEMBL3581527
Type:
Small organic molecule
Emp. Form.:
C41H60O15
Mol. Mass.:
792.9061
SMILES:
[H][C@@]12C[C@]3([H])CC(=O)O[C@@]3(O1)C(=O)C(C)(C)\C=C\[C@@]1([H])C\C(C[C@@]([H])(C[C@]3(O)O[C@@]([H])(C[C@H](OC(=O)C(C)(C)C)C3(C)C)C[C@@H](O)CC(=O)O[C@H](C)[C@H](O)C2)O1)=C/C(=O)OC
: