Target
Estrogen receptor
Ligand
BDBM50041611
Substrate
Meas. Tech.
ChEMBL_1497713 (CHEMBL3582719)
EC50
390±n/a nM
Citation
 Lai, AKahraman, MGovek, SNagasawa, JBonnefous, CJulien, JDouglas, KSensintaffar, JLu, NLee, KJAparicio, AKaufman, JQian, JShao, GPrudente, RMoon, MJJoseph, JDDarimont, BBrigham, DGrillot, KHeyman, RRix, PJHager, JHSmith, ND Identification of GDC-0810 (ARN-810), an Orally Bioavailable Selective Estrogen Receptor Degrader (SERD) that Demonstrates Robust Activity in Tamoxifen-Resistant Breast Cancer Xenografts. J Med Chem 58:4888-904 (2015)  
Target
Name:
Estrogen receptor
Synonyms:
ER ESR ESR1_HUMAN Estrogen receptor Estrogen receptor (ER-alpha) Estrogen receptor alpha (ER) Nuclear receptor subfamily 3 group A member 1
Type:
Protein
Mol. Mass.:
66230.44
Organism:
Homo sapiens (Human)
Description:
P03372
Residue:
595
  
Inhibitor
Name:
BDBM50041611
Synonyms:
(2E)-3-{4-[(1E)-1,2-DIPHENYLBUT-1-ENYL]PHENYL}ACRYLIC ACID CHEMBL33899
Type:
Small organic molecule
Emp. Form.:
C25H22O2
Mol. Mass.:
354.441
SMILES:
CC\C(=C(/c1ccccc1)c1ccc(\C=C\C(O)=O)cc1)c1ccccc1
: