Target
Alpha-1B adrenergic receptor
Ligand
BDBM50091349
Substrate
Meas. Tech.
ChEMBL_1497771 (CHEMBL3583291)
Ki
7.3±n/a nM
Citation
 Zhang, WMa, ZLi, WLi, GChen, LLiu, ZDu, LLi, M Discovery of Quinazoline-Based Fluorescent Probes toa1-Adrenergic Receptors. ACS Med Chem Lett 6:502-6 (2015)  
Target
Name:
Alpha-1B adrenergic receptor
Synonyms:
ADA1B_HUMAN Adrenergic alpha1B Adrenergic receptor alpha Alpha 1B-adrenoreceptor | Alpha-1B adrenergic receptor
Type:
Enzyme
Mol. Mass.:
56862.13
Organism:
Homo sapiens (Human)
Description:
P35368
Residue:
520
  
Inhibitor
Name:
BDBM50091349
Synonyms:
CHEMBL3582271
Type:
Small organic molecule
Emp. Form.:
C35H30N6O7S
Mol. Mass.:
678.714
SMILES:
COc1cc2nc(nc(N)c2cc1OC)N1CCN(CC1)C(=S)Nc1ccc(c(c1)C(O)=O)-c1c2ccc(O)cc2oc2cc(=O)ccc12
: