Target
Serine/threonine-protein kinase mTOR
Ligand
BDBM50092783
Substrate
Meas. Tech.
ChEMBL_1501613 (CHEMBL3587365)
IC50
10.0±n/a nM
Citation
Target
Name:
Serine/threonine-protein kinase mTOR
Synonyms:
FK506-binding protein 12-rapamycin complex-associated protein 1 FRAP FRAP1 MTOR Mammalian Target of Rapamycin (mTOR) RAFT1 Rapamycin and FKBP12 target 1 Serine/threonine-protein kinase (mTOR) | mTORC2
Type:
Rapamycin target protein
Mol. Mass.:
288917.12
Organism:
Homo sapiens (Human)
Description:
P42345
Residue:
2549
  
Inhibitor
Name:
BDBM50092783
Synonyms:
CHEMBL3586404
Type:
Small organic molecule
Emp. Form.:
C21H27N5O3
Mol. Mass.:
397.4708
SMILES:
CO[C@H]1CC[C@@H](CC1)N1C(=O)CNc2ncc(nc12)-c1ccc(nc1)C(C)(C)O
: