Target
Bromodomain-containing protein 2
Ligand
BDBM50094886
Substrate
Meas. Tech.
ChEMBL_1502940 (CHEMBL3591777)
IC50
22000±n/a nM
Citation
 Duffy, BCLiu, SMartin, GSWang, RHsia, MMZhao, HGuo, CEllis, MQuinn, JFKharenko, OANorek, KGesner, EMYoung, PRMcLure, KGWagner, GSLakshminarasimhan, DWhite, ASuto, RKHansen, HCKitchen, DB Discovery of a new chemical series of BRD4(1) inhibitors using protein-ligand docking and structure-guided design. Bioorg Med Chem Lett 25:2818-23 (2015)  
Target
Name:
Bromodomain-containing protein 2
Synonyms:
BRD2 Bromodomain and extra-terminal motif (BET) Bromodomain-containing protein 2 (BRD2) RING3
Type:
Protein
Mol. Mass.:
88085.95
Organism:
Homo sapiens (Human)
Description:
P25440
Residue:
801
  
Inhibitor
Name:
BDBM50094886
Synonyms:
CHEMBL3589468
Type:
Small organic molecule
Emp. Form.:
C24H20N2O3
Mol. Mass.:
384.4272
SMILES:
COc1ccc(\C=C(\C(=O)N2CC(=O)Nc3ccccc23)c2ccccc2)cc1
: