Target
Phosphatidylinositol 4,5-bisphosphate 3-kinase catalytic subunit alpha isoform
Ligand
BDBM50094949
Substrate
Meas. Tech.
ChEMBL_1502979 (CHEMBL3591913)
IC50
3.8±n/a nM
Citation
 Ibrahim, MAAbou-Seri, SMHanna, MMAbdalla, MMEl Sayed, NA Design, synthesis and biological evaluation of novel condensed pyrrolo[1,2-c]pyrimidines featuring morpholine moiety as PI3Ka inhibitors. Eur J Med Chem 99:1-13 (2015)  
Target
Name:
Phosphatidylinositol 4,5-bisphosphate 3-kinase catalytic subunit alpha isoform
Synonyms:
PI3-kinase p110 subunit alpha PI3K PK3CA_BOVIN Phosphoinositide 3-Kinase (PI3K), alpha | PtdIns-3-kinase p110
Type:
PROTEIN
Mol. Mass.:
124338.95
Organism:
Bos taurus
Description:
ChEMBL_1502979
Residue:
1068
  
Inhibitor
Name:
BDBM50094949
Synonyms:
CHEMBL3589378
Type:
Small organic molecule
Emp. Form.:
C24H27N5O3S
Mol. Mass.:
465.568
SMILES:
CCN1C(=S)N2CCCC2c2c1nc(-c1ccc(OC)c(O)c1)c(C#N)c2N1CCOCC1
: