Target
Phosphatidylinositol 4,5-bisphosphate 3-kinase catalytic subunit beta isoform
Ligand
BDBM50094942
Substrate
Meas. Tech.
ChEMBL_1502980 (CHEMBL3591914)
IC50
80±n/a nM
Citation
 Ibrahim, MAAbou-Seri, SMHanna, MMAbdalla, MMEl Sayed, NA Design, synthesis and biological evaluation of novel condensed pyrrolo[1,2-c]pyrimidines featuring morpholine moiety as PI3Ka inhibitors. Eur J Med Chem 99:1-13 (2015)  
Target
Name:
Phosphatidylinositol 4,5-bisphosphate 3-kinase catalytic subunit beta isoform
Synonyms:
PI3-kinase p110 subunit beta PI3Kbeta PIK3CB Phosphatidylinositol 4,5-bisphosphate 3-kinase catalytic subunit beta (PI3Kbeta) Phosphatidylinositol 4,5-bisphosphate 3-kinase catalytic subunit beta isoform (PI3K) Phosphatidylinositol 4,5-bisphosphate 3-kinase catalytic subunit beta isoform (PI3Kbeta) Phosphatidylinositol-4,5-bisphosphate 3-kinase catalytic subunit beta isoform Phosphoinositide 3-Kinase (PI3K), beta Chain A PtdIns-3-kinase p110
Type:
Enzyme Subunit
Mol. Mass.:
122769.00
Organism:
Homo sapiens (Human)
Description:
P42338
Residue:
1070
  
Inhibitor
Name:
BDBM50094942
Synonyms:
CHEMBL3589371
Type:
Small organic molecule
Emp. Form.:
C20H23N5O2S
Mol. Mass.:
397.494
SMILES:
O=c1[nH]c(CN2CCOCC2)nc2N(C(=S)N3CCCC3c12)c1ccccc1
: