Target
Phosphatidylinositol 4,5-bisphosphate 3-kinase catalytic subunit gamma isoform
Ligand
BDBM50094943
Substrate
Meas. Tech.
ChEMBL_1502981 (CHEMBL3591915)
IC50
1340±n/a nM
Citation
 Ibrahim, MAAbou-Seri, SMHanna, MMAbdalla, MMEl Sayed, NA Design, synthesis and biological evaluation of novel condensed pyrrolo[1,2-c]pyrimidines featuring morpholine moiety as PI3Ka inhibitors. Eur J Med Chem 99:1-13 (2015)  
Target
Name:
Phosphatidylinositol 4,5-bisphosphate 3-kinase catalytic subunit gamma isoform
Synonyms:
PI3-kinase p110 subunit gamma PI3Kgamma PK3CG_HUMAN Phosphatidylinositol 4,5-bisphosphate 3-kinase (PI3K) Phosphatidylinositol 4,5-bisphosphate 3-kinase catalytic subunit gamma (PI3Kgamma) Phosphatidylinositol 4,5-bisphosphate 3-kinase catalytic subunit gamma isoform (PI3K) Phosphatidylinositol-4,5-bisphosphate 3-kinase catalytic subunit gamma isoform Phosphoinositide 3-kinases gamma (PI3K gamma) p120-PI3K
Type:
Enzyme Subunit
Mol. Mass.:
126470.30
Organism:
Homo sapiens (Human)
Description:
P48736
Residue:
1102
  
Inhibitor
Name:
BDBM50094943
Synonyms:
CHEMBL3589372
Type:
Small organic molecule
Emp. Form.:
C21H25N5O2S
Mol. Mass.:
411.521
SMILES:
CC(N1CCOCC1)c1nc2N(C(=S)N3CCCC3c2c(=O)[nH]1)c1ccccc1
: