Target
Protein arginine N-methyltransferase 8
Ligand
BDBM50095349
Substrate
Meas. Tech.
ChEMBL_1504109 (CHEMBL3591483)
IC50
70±n/a nM
Citation
 Mitchell, LHDrew, AERibich, SARioux, NSwinger, KKJacques, SLLingaraj, TBoriack-Sjodin, PAWaters, NJWigle, TJMoradei, OJin, LRiera, TPorter-Scott, MMoyer, MPSmith, JJChesworth, RCopeland, RA Aryl Pyrazoles as Potent Inhibitors of Arginine Methyltransferases: Identification of the First PRMT6 Tool Compound. ACS Med Chem Lett 6:655-9 (2015)  
Target
Name:
Protein arginine N-methyltransferase 8
Synonyms:
ANM8_HUMAN HRMT1L3 Heterogeneous nuclear ribonucleoprotein methyltransferase-like protein 4 Protein arginine N-methyltransferase 8 Protein arginine methyltransferase 8 (PRMT8)
Type:
Protein
Mol. Mass.:
45293.70
Organism:
Homo sapiens (Human)
Description:
Residue:
394
  
Inhibitor
Name:
BDBM50095349
Synonyms:
CHEMBL3589035
Type:
Small organic molecule
Emp. Form.:
C17H22ClF3N4O
Mol. Mass.:
390.831
SMILES:
CC(C)Oc1c(Cl)cc(cc1C(F)(F)F)-c1c[nH]nc1CN(C)CCN
: