Target
Protein arginine N-methyltransferase 8
Ligand
BDBM50095433
Substrate
Meas. Tech.
ChEMBL_1504109 (CHEMBL3591483)
IC50
28±n/a nM
Citation
 Mitchell, LHDrew, AERibich, SARioux, NSwinger, KKJacques, SLLingaraj, TBoriack-Sjodin, PAWaters, NJWigle, TJMoradei, OJin, LRiera, TPorter-Scott, MMoyer, MPSmith, JJChesworth, RCopeland, RA Aryl Pyrazoles as Potent Inhibitors of Arginine Methyltransferases: Identification of the First PRMT6 Tool Compound. ACS Med Chem Lett 6:655-9 (2015)  
Target
Name:
Protein arginine N-methyltransferase 8
Synonyms:
ANM8_HUMAN HRMT1L3 Heterogeneous nuclear ribonucleoprotein methyltransferase-like protein 4 Protein arginine N-methyltransferase 8 Protein arginine methyltransferase 8 (PRMT8)
Type:
Protein
Mol. Mass.:
45293.70
Organism:
Homo sapiens (Human)
Description:
Residue:
394
  
Inhibitor
Name:
BDBM50095433
Synonyms:
CHEMBL3589913
Type:
Small organic molecule
Emp. Form.:
C16H24N4O
Mol. Mass.:
288.388
SMILES:
CCOc1ccc(cc1)-c1[nH]ncc1CN(C)CCNC
: