Target
Dihydroorotate dehydrogenase (quinone), mitochondrial
Ligand
BDBM50096200
Substrate
Meas. Tech.
ChEMBL_1505693 (CHEMBL3594613)
IC50
13±n/a nM
Citation
 Abdullah, IChee, CFLee, YKThunuguntla, SSSatish Reddy, KNellore, KAntony, TVerma, JMun, KWOthman, SSubramanya, HRahman, NA Benzimidazole derivatives as potential dual inhibitors for PARP-1 and DHODH. Bioorg Med Chem 23:4669-80 (2015)  
Target
Name:
Dihydroorotate dehydrogenase (quinone), mitochondrial
Synonyms:
DHODH Dihydroorotate dehydrogenase Dihydroorotate dehydrogenase, mitochondrial Dihydroorotate oxidase (DHODH) | PYRD_HUMAN
Type:
Enzyme
Mol. Mass.:
42881.33
Organism:
Homo sapiens (Human)
Description:
Q02127
Residue:
395
  
Inhibitor
Name:
BDBM50096200
Synonyms:
CHEMBL3593806
Type:
Small organic molecule
Emp. Form.:
C30H25N3O4
Mol. Mass.:
491.5372
SMILES:
CC(=O)Nc1ccc(COc2ccc(cc2)-c2ccc(cc2)-c2nc3c(cc(C)cc3[nH]2)C(O)=O)cc1
: