Target
Dihydroorotate dehydrogenase (quinone), mitochondrial
Ligand
BDBM15339
Substrate
Meas. Tech.
ChEMBL_1505693 (CHEMBL3594613)
IC50
12±n/a nM
Citation
 Abdullah, IChee, CFLee, YKThunuguntla, SSSatish Reddy, KNellore, KAntony, TVerma, JMun, KWOthman, SSubramanya, HRahman, NA Benzimidazole derivatives as potential dual inhibitors for PARP-1 and DHODH. Bioorg Med Chem 23:4669-80 (2015)  
Target
Name:
Dihydroorotate dehydrogenase (quinone), mitochondrial
Synonyms:
DHODH Dihydroorotate dehydrogenase Dihydroorotate dehydrogenase, mitochondrial Dihydroorotate oxidase (DHODH) | PYRD_HUMAN
Type:
Enzyme
Mol. Mass.:
42881.33
Organism:
Homo sapiens (Human)
Description:
Q02127
Residue:
395
  
Inhibitor
Name:
BDBM15339
Synonyms:
6-fluoro-2-[4-(2-fluorophenyl)phenyl]-3-methyl-quinoline-4-carboxylic acid Biphenquinate US20240034730, Compound Brequinar
Type:
Small organic molecule
Emp. Form.:
C23H15F2NO2
Mol. Mass.:
375.3675
SMILES:
Cc1c(nc2ccc(F)cc2c1C(O)=O)-c1ccc(cc1)-c1ccccc1F
: