Target
Poly [ADP-ribose] polymerase 1
Ligand
BDBM50300015
Substrate
Meas. Tech.
ChEMBL_1505691 (CHEMBL3594611)
IC50
22±n/a nM
Citation
 Abdullah, IChee, CFLee, YKThunuguntla, SSSatish Reddy, KNellore, KAntony, TVerma, JMun, KWOthman, SSubramanya, HRahman, NA Benzimidazole derivatives as potential dual inhibitors for PARP-1 and DHODH. Bioorg Med Chem 23:4669-80 (2015)  
Target
Name:
Poly [ADP-ribose] polymerase 1
Synonyms:
(ARTD1 or PARP1) 2.4.2.30 ADPRT ARTD1 Human diphtheria toxin-like ADP-ribosyltransferase (ARTD1 or PARP1) NT-PARP-1 PARP1 PPOL Poly [ADP-ribose] polymerase 1 (PARP) Poly [ADP-ribose] polymerase 1 (PARP1) Poly [ADP-ribose] polymerase 1, 28-kDa form Poly [ADP-ribose] polymerase 1, processed C-terminus Poly [ADP-ribose] polymerase-1 Poly(ADP-ribose) polymerase-1 (ARTD1/PARP1) Protein poly-ADP-ribosyltransferase PARP1 | Synonyms=ADPRT
Type:
Mol. Mass.:
113114.22
Organism:
Homo sapiens (Human)
Description:
P09874
Residue:
1014
  
Inhibitor
Name:
BDBM50300015
Synonyms:
2-(4-(Pyridin-3-yl)phenyl)-1H-benzo[d]imidazole-4-carboxamide CHEMBL571285
Type:
Small organic molecule
Emp. Form.:
C19H14N4O
Mol. Mass.:
314.3407
SMILES:
NC(=O)c1cccc2[nH]c(nc12)-c1ccc(cc1)-c1cccnc1
: