Target
Serine/threonine-protein kinase PAK 4
Ligand
BDBM50096231
Substrate
Meas. Tech.
ChEMBL_1505870 (CHEMBL3595327)
Ki
272±n/a nM
Citation
 Rudolph, JAliagas, ICrawford, JJMathieu, SLee, WChao, QDong, PRouge, LWang, WHeise, CMurray, LJLa, HLiu, YManning, GDiederich, FHoeflich, KP Leveraging the Pre-DFG Residue Thr-406 To Obtain High Kinase Selectivity in an Aminopyrazole-Type PAK1 Inhibitor Series. ACS Med Chem Lett 6:711-5 (2015)  
Target
Name:
Serine/threonine-protein kinase PAK 4
Synonyms:
KIAA1142 PAK4_HUMAN | p21-Activated kinase 4 (PAK4)
Type:
Protein
Mol. Mass.:
64098.01
Organism:
Homo sapiens (Human)
Description:
O96013
Residue:
591
  
Inhibitor
Name:
BDBM50096231
Synonyms:
CHEMBL3580975
Type:
Small organic molecule
Emp. Form.:
C19H19ClN8
Mol. Mass.:
394.861
SMILES:
CN(Cc1ccc2[nH]cnc2c1Cl)c1nccc(Nc2cc([nH]n2)C2CC2)n1
: