Target
Aurora kinase A
Ligand
BDBM50096231
Substrate
Meas. Tech.
ChEMBL_1505871 (CHEMBL3595328)
Ki
3.0±n/a nM
Citation
 Rudolph, JAliagas, ICrawford, JJMathieu, SLee, WChao, QDong, PRouge, LWang, WHeise, CMurray, LJLa, HLiu, YManning, GDiederich, FHoeflich, KP Leveraging the Pre-DFG Residue Thr-406 To Obtain High Kinase Selectivity in an Aminopyrazole-Type PAK1 Inhibitor Series. ACS Med Chem Lett 6:711-5 (2015)  
Target
Name:
Aurora kinase A
Synonyms:
AIK ARK-1 AURA AURKA_HUMAN Aurora 2 Aurora kinase A (AURKA) Aurora kinase A (Aurora-2) Aurora/IPL1-related kinase 1 Breast tumor-amplified kinase IAK1 STK15 GN Serine/threonine kinase 15 Serine/threonine-protein kinase 6 Serine/threonine-protein kinase aurora-A aurora-2 | hARK1
Type:
Serine/threonine-protein kinase
Mol. Mass.:
45830.98
Organism:
Homo sapiens (Human)
Description:
O14965
Residue:
403
  
Inhibitor
Name:
BDBM50096231
Synonyms:
CHEMBL3580975
Type:
Small organic molecule
Emp. Form.:
C19H19ClN8
Mol. Mass.:
394.861
SMILES:
CN(Cc1ccc2[nH]cnc2c1Cl)c1nccc(Nc2cc([nH]n2)C2CC2)n1
: