Target
Dual specificity protein kinase CLK3
Ligand
BDBM50097854
Substrate
Meas. Tech.
ChEMBL_1502247 (CHEMBL3591183)
IC50
>10000±n/a nM
Citation
 Falke, HChaikuad, ABecker, ALoaëc, NLozach, OAbu Jhaisha, SBecker, WJones, PGPreu, LBaumann, KKnapp, SMeijer, LKunick, C 10-iodo-11H-indolo[3,2-c]quinoline-6-carboxylic acids are selective inhibitors of DYRK1A. J Med Chem 58:3131-43 (2015)  
Target
Name:
Dual specificity protein kinase CLK3
Synonyms:
CDC-like kinase 3 Clk3
Type:
PROTEIN
Mol. Mass.:
73855.32
Organism:
Mus musculus
Description:
ChEMBL_1502247
Residue:
638
  
Inhibitor
Name:
BDBM50097854
Synonyms:
CHEMBL3589665
Type:
Small organic molecule
Emp. Form.:
C17H11ClN2O3
Mol. Mass.:
326.734
SMILES:
COc1ccc2c3[nH]c4c(Cl)cccc4c3c(nc2c1)C(O)=O
: