Target
Alpha-1D adrenergic receptor
Ligand
BDBM50099458
Substrate
Meas. Tech.
ChEMBL_1440680 (CHEMBL3381315)
Ki
7.1±n/a nM
Citation
 Franchini, SBattisti, UMBaraldi, APrandi, AFossa, PCichero, ETait, ASorbi, CMarucci, GCilia, APirona, LBrasili, L Structure-affinity/activity relationships of 1,4-dioxa-spiro[4.5]decane based ligands ata<alpha>1 and 5-HT1A receptors. Eur J Med Chem 87:248-66 (2014)  
Target
Name:
Alpha-1D adrenergic receptor
Synonyms:
ADA1D_HUMAN ADRA1D Adrenergic receptor alpha Alpha 1D-adrenoreceptor Alpha-1D adrenoceptor adrenergic Alpha1D
Type:
Enzyme Catalytic Domain
Mol. Mass.:
60485.82
Organism:
Homo sapiens (Human)
Description:
adrenergic Alpha1D ADRA1D HUMAN::P25100
Residue:
572
  
Inhibitor
Name:
BDBM50099458
Synonyms:
CHEMBL3342868
Type:
Small organic molecule
Emp. Form.:
C25H32ClN3O5S
Mol. Mass.:
522.057
SMILES:
COc1ccccc1N1CCN(CC2COC3(CCN(CC3)S(=O)(=O)c3ccc(Cl)cc3)O2)CC1
: