Target
Alpha-1A adrenergic receptor
Ligand
BDBM50099458
Substrate
Meas. Tech.
ChEMBL_1440678 (CHEMBL3390430)
Ki
6.5±n/a nM
Citation
 Franchini, SBattisti, UMBaraldi, APrandi, AFossa, PCichero, ETait, ASorbi, CMarucci, GCilia, APirona, LBrasili, L Structure-affinity/activity relationships of 1,4-dioxa-spiro[4.5]decane based ligands ata<alpha>1 and 5-HT1A receptors. Eur J Med Chem 87:248-66 (2014)  
Target
Name:
Alpha-1A adrenergic receptor
Synonyms:
ADA1A_HUMAN ADRA1C Alpha 1A-adrenoceptor Alpha adrenergic receptor 1a Alpha-adrenergic receptor 1c adrenergic Alpha1 | adrenergic Alpha1C
Type:
Cell-surface receptors
Mol. Mass.:
51511.67
Organism:
Homo sapiens (Human)
Description:
P35348
Residue:
466
  
Inhibitor
Name:
BDBM50099458
Synonyms:
CHEMBL3342868
Type:
Small organic molecule
Emp. Form.:
C25H32ClN3O5S
Mol. Mass.:
522.057
SMILES:
COc1ccccc1N1CCN(CC2COC3(CCN(CC3)S(=O)(=O)c3ccc(Cl)cc3)O2)CC1
: