Target
Subtilisin-like protease 1
Ligand
BDBM50100737
Substrate
Meas. Tech.
ChEMBL_1456858 (CHEMBL3367591)
IC50
20000±n/a nM
Citation
 Kher, SSPenzo, MFulle, SFinn, PWBlackman, MJJirgensons, A Substrate derived peptidica-ketoamides as inhibitors of the malarial protease PfSUB1. Bioorg Med Chem Lett 24:4486-9 (2014)  
Target
Name:
Subtilisin-like protease 1
Synonyms:
SUB1 Subtilisin-like protease sub-1
Type:
PROTEIN
Mol. Mass.:
77866.88
Organism:
Plasmodium falciparum
Description:
ChEMBL_830092
Residue:
690
  
Inhibitor
Name:
BDBM50100737
Synonyms:
CHEMBL3326338
Type:
Small organic molecule
Emp. Form.:
C24H41N5O9
Mol. Mass.:
543.6104
SMILES:
CC[C@H](C)[C@H](NC(C)=O)C(=O)N[C@@H]([C@@H](C)O)C(=O)N[C@@H](C)C(=O)NC(C(C)C)C(=O)C(=O)NCCC(O)=O
: