Target
Subtilisin-like protease 1
Ligand
BDBM50100884
Substrate
Meas. Tech.
ChEMBL_1456858 (CHEMBL3367591)
IC50
10000±n/a nM
Citation
 Kher, SSPenzo, MFulle, SFinn, PWBlackman, MJJirgensons, A Substrate derived peptidica-ketoamides as inhibitors of the malarial protease PfSUB1. Bioorg Med Chem Lett 24:4486-9 (2014)  
Target
Name:
Subtilisin-like protease 1
Synonyms:
SUB1 Subtilisin-like protease sub-1
Type:
PROTEIN
Mol. Mass.:
77866.88
Organism:
Plasmodium falciparum
Description:
ChEMBL_830092
Residue:
690
  
Inhibitor
Name:
BDBM50100884
Synonyms:
CHEMBL3325860
Type:
Small organic molecule
Emp. Form.:
C27H48ClN7O10
Mol. Mass.:
666.164
SMILES:
Cl.CC[C@H](C)[C@H](NC(=O)[C@H](CCCCN)NC(C)=O)C(=O)N[C@@H]([C@@H](C)O)C(=O)N[C@@H](C)C(=O)NC(C)C(=O)C(=O)NCC(O)=O
: