Target
Subtilisin-like protease 1
Ligand
BDBM50100890
Substrate
Meas. Tech.
ChEMBL_1456858 (CHEMBL3367591)
IC50
300±n/a nM
Citation
 Kher, SSPenzo, MFulle, SFinn, PWBlackman, MJJirgensons, A Substrate derived peptidica-ketoamides as inhibitors of the malarial protease PfSUB1. Bioorg Med Chem Lett 24:4486-9 (2014)  
Target
Name:
Subtilisin-like protease 1
Synonyms:
SUB1 Subtilisin-like protease sub-1
Type:
PROTEIN
Mol. Mass.:
77866.88
Organism:
Plasmodium falciparum
Description:
ChEMBL_830092
Residue:
690
  
Inhibitor
Name:
BDBM50100890
Synonyms:
CHEMBL3325855
Type:
Small organic molecule
Emp. Form.:
C30H24O13
Mol. Mass.:
592.5038
SMILES:
OC1Cc2c(O)cc3OC4(Oc5c(O)c(O)cc(O)c5C(C4O)c3c2OC1c1ccc(O)c(O)c1)c1ccc(O)c(O)c1
: