Target
Cytochrome P450 2A13
Ligand
BDBM82070
Substrate
Meas. Tech.
ChEMBL_1486539 (CHEMBL3532208)
Ki
72000±n/a nM
Citation
 Stephens, ESWalsh, AAScott, EE Evaluation of inhibition selectivity for human cytochrome P450 2A enzymes. Drug Metab Dispos 40:1797-802 (2012)  
Target
Name:
Cytochrome P450 2A13
Synonyms:
CP2AD_HUMAN CYPIIA13 | Cytochrome P450 2A13 (CYP2A13)
Type:
Protein
Mol. Mass.:
56702.46
Organism:
Homo sapiens (Human)
Description:
Q16696
Residue:
494
  
Inhibitor
Name:
BDBM82070
Synonyms:
CAS_29790-52-1 Nicotine-D salicylate US9303017, Nicotine
Type:
Emp. Form.:
C10H14N2
Mol. Mass.:
162.2316
SMILES:
CN1CCC[C@H]1c1cccnc1
: