Target
Cytochrome P450 1A2
Ligand
BDBM50130273
Substrate
Meas. Tech.
ChEMBL_1485706 (CHEMBL3541098)
IC50
4490±n/a nM
Citation
 Ren, SZeng, JMei, YZhang, JZYan, SFFei, JChen, L Discovery and characterization of novel, potent, and selective cytochrome P450 2J2 inhibitors. Drug Metab Dispos 41:60-71 (2012)  
Target
Name:
Cytochrome P450 1A2
Synonyms:
CP1A2_HUMAN CYPIA2 Cytochrome P(3)450 Cytochrome P450 1A2 (CYP1A2) Cytochrome P450-P3
Type:
Enzyme
Mol. Mass.:
58423.38
Organism:
Homo sapiens (Human)
Description:
P05177
Residue:
516
  
Inhibitor
Name:
BDBM50130273
Synonyms:
2-(4-[3-(2-chloro-10H-phenothiazin-10-yl)propyl]-1-piperazinyl)ethanol 2-{4-[3-(2-chloro-10H-phenothiazin-10-yl)propyl]piperazin-1-yl}ethanol 4-[3-(2-chlorophenothiazin-10-yl)propyl]-1-piperazineethanol Chlorpiprazine Perfenazine Trilafon | gamma-(4-(beta-hydroxyethyl)piperazin-1-yl)propyl-2-chlorophenothiazine
Type:
Small organic molecule
Emp. Form.:
C21H26ClN3OS
Mol. Mass.:
403.969
SMILES:
OCCN1CCN(CCCN2c3ccccc3Sc3ccc(Cl)cc23)CC1
: