Target
Cytochrome P450 2J2
Ligand
BDBM50158460
Substrate
Meas. Tech.
ChEMBL_1485701 (CHEMBL3541093)
IC50
4260±n/a nM
Citation
 Ren, SZeng, JMei, YZhang, JZYan, SFFei, JChen, L Discovery and characterization of novel, potent, and selective cytochrome P450 2J2 inhibitors. Drug Metab Dispos 41:60-71 (2012)  
Target
Name:
Cytochrome P450 2J2
Synonyms:
CP2J2_HUMAN | CYP2J2
Type:
Enzyme
Mol. Mass.:
57623.04
Organism:
Homo sapiens (Human)
Description:
P51589
Residue:
502
  
Inhibitor
Name:
BDBM50158460
Synonyms:
(3,5-dibromo-4-hydroxyphenyl)(2-ethyl-1-benzofuran-3-yl)methanone 3,5-dibromo-4-hydroxyphenyl-2-ethyl-3-benzofuranyl ketone CHEMBL388590 US9856239, benzbromarone Uroleap (TN) | cid_2333
Type:
Small organic molecule
Emp. Form.:
C17H12Br2O3
Mol. Mass.:
424.083
SMILES:
CCc1oc2ccccc2c1C(=O)c1cc(Br)c(O)c(Br)c1
: