Target
Cytochrome P450 3A4
Ligand
BDBM78934
Substrate
Meas. Tech.
ChEMBL_1485703 (CHEMBL3541095)
IC50
470±n/a nM
Citation
 Ren, SZeng, JMei, YZhang, JZYan, SFFei, JChen, L Discovery and characterization of novel, potent, and selective cytochrome P450 2J2 inhibitors. Drug Metab Dispos 41:60-71 (2012)  
Target
Name:
Cytochrome P450 3A4
Synonyms:
Albendazole monooxygenase CP3A4_HUMAN CYP3A4 CYPIIIA4 Cytochrome P450 3A4 (CYP3A4) Nifedipine oxidase Taurochenodeoxycholate 6-alpha-hydroxylase
Type:
Enzyme
Mol. Mass.:
57349.57
Organism:
Homo sapiens (Human)
Description:
Residue:
503
  
Inhibitor
Name:
BDBM78934
Synonyms:
2-methoxyacetic acid [(1S,2S)-2-[2-[3-(1H-benzimidazol-2-yl)propyl-methyl-amino]ethyl]-6-fluoro-1-isopropyl-tetralin-2-yl] ester;hydrate;hydrochloride MLS001056800 SMR000326970 [(1S,2S)-2-[2-[3-(1H-benzimidazol-2-yl)propyl-methyl-amino]ethyl]-6-fluoranyl-1-propan-2-yl-3,4-dihydro-1H-naphthalen-2-yl] 2-methoxyethanoate;hydrate;hydrochloride cid_16746591
Type:
Small organic molecule
Emp. Form.:
C29H38FN3O3
Mol. Mass.:
495.6287
SMILES:
COCC(=O)O[C@]1(CCN(C)CCCc2nc3ccccc3[nH]2)CCc2cc(F)ccc2[C@@H]1C(C)C
: