Target
Cytochrome P450 2J2
Ligand
BDBM21398
Substrate
Meas. Tech.
ChEMBL_1485701 (CHEMBL3541093)
IC50
4690±n/a nM
Citation
 Ren, SZeng, JMei, YZhang, JZYan, SFFei, JChen, L Discovery and characterization of novel, potent, and selective cytochrome P450 2J2 inhibitors. Drug Metab Dispos 41:60-71 (2012)  
Target
Name:
Cytochrome P450 2J2
Synonyms:
CP2J2_HUMAN | CYP2J2
Type:
Enzyme
Mol. Mass.:
57623.04
Organism:
Homo sapiens (Human)
Description:
P51589
Residue:
502
  
Inhibitor
Name:
BDBM21398
Synonyms:
4-[4-(4-Chloro-phenyl)-4-hydroxy-piperidin-1-yl]-1-(4-fluoro-phenyl)-butan-1-one;propionate(HCl) CHEMBL54 Haloperidol | Haloperidol, 1
Type:
Small organic molecule
Emp. Form.:
C21H23ClFNO2
Mol. Mass.:
375.864
SMILES:
OC1(CCN(CCCC(=O)c2ccc(F)cc2)CC1)c1ccc(Cl)cc1
: