Target
Cytochrome P450 2C19
Ligand
BDBM50101817
Substrate
Meas. Tech.
ChEMBL_1485705 (CHEMBL3541097)
IC50
5420±n/a nM
Citation
 Ren, SZeng, JMei, YZhang, JZYan, SFFei, JChen, L Discovery and characterization of novel, potent, and selective cytochrome P450 2J2 inhibitors. Drug Metab Dispos 41:60-71 (2012)  
Target
Name:
Cytochrome P450 2C19
Synonyms:
(R)-limonene 6-monooxygenase (S)-limonene 7-monooxygenase CYP2C19 CYPIIC19 Cytochrome P450 2C19 [I331V] Cytochrome P450-254C Mephenytoin 4-hydroxylase P450-254C
Type:
Enzyme
Mol. Mass.:
55935.47
Organism:
Homo sapiens (Human)
Description:
P33261
Residue:
490
  
Inhibitor
Name:
BDBM50101817
Synonyms:
Adalat Afeditab Cr CHEBI:7565 Procardia | Procardia Xl
Type:
Small organic molecule
Emp. Form.:
C17H18N2O6
Mol. Mass.:
346.3346
SMILES:
COC(=O)C1=C(C)NC(C)=C(C1c1ccccc1[N+]([O-])=O)C(=O)OC
: