Target
Cytochrome P450 1A2
Ligand
BDBM79021
Substrate
Meas. Tech.
ChEMBL_1485706 (CHEMBL3541098)
IC50
29700±n/a nM
Citation
 Ren, SZeng, JMei, YZhang, JZYan, SFFei, JChen, L Discovery and characterization of novel, potent, and selective cytochrome P450 2J2 inhibitors. Drug Metab Dispos 41:60-71 (2012)  
Target
Name:
Cytochrome P450 1A2
Synonyms:
CP1A2_HUMAN CYPIA2 Cytochrome P(3)450 Cytochrome P450 1A2 (CYP1A2) Cytochrome P450-P3
Type:
Enzyme
Mol. Mass.:
58423.38
Organism:
Homo sapiens (Human)
Description:
P05177
Residue:
516
  
Inhibitor
Name:
BDBM79021
Synonyms:
(1S,4S)-4-(3,4-dichlorophenyl)-N-methyl-1,2,3,4-tetrahydronaphthalen-1-amine;hydrochloride NCGC00092386 Sertraline cid_63009
Type:
Small organic molecule
Emp. Form.:
C17H17Cl2N
Mol. Mass.:
306.23
SMILES:
CN[C@H]1CC[C@@H](c2ccc(Cl)c(Cl)c2)c2ccccc12
: