Target
Cytochrome P450 3A4
Ligand
BDBM50101815
Substrate
Meas. Tech.
ChEMBL_1485703 (CHEMBL3541095)
IC50
380±n/a nM
Citation
 Ren, SZeng, JMei, YZhang, JZYan, SFFei, JChen, L Discovery and characterization of novel, potent, and selective cytochrome P450 2J2 inhibitors. Drug Metab Dispos 41:60-71 (2012)  
Target
Name:
Cytochrome P450 3A4
Synonyms:
Albendazole monooxygenase CP3A4_HUMAN CYP3A4 CYPIIIA4 Cytochrome P450 3A4 (CYP3A4) Nifedipine oxidase Taurochenodeoxycholate 6-alpha-hydroxylase
Type:
Enzyme
Mol. Mass.:
57349.57
Organism:
Homo sapiens (Human)
Description:
Residue:
503
  
Inhibitor
Name:
BDBM50101815
Synonyms:
CHEBI:7550 | Nicardipine
Type:
Small organic molecule
Emp. Form.:
C26H29N3O6
Mol. Mass.:
479.525
SMILES:
COC(=O)C1=C(C)NC(C)=C(C1c1cccc(c1)[N+]([O-])=O)C(=O)OCCN(C)Cc1ccccc1
: