Target
Cytochrome P450 2J2
Ligand
BDBM50017702
Substrate
Meas. Tech.
ChEMBL_1485701 (CHEMBL3541093)
IC50
940±n/a nM
Citation
 Ren, SZeng, JMei, YZhang, JZYan, SFFei, JChen, L Discovery and characterization of novel, potent, and selective cytochrome P450 2J2 inhibitors. Drug Metab Dispos 41:60-71 (2012)  
Target
Name:
Cytochrome P450 2J2
Synonyms:
CP2J2_HUMAN | CYP2J2
Type:
Enzyme
Mol. Mass.:
57623.04
Organism:
Homo sapiens (Human)
Description:
P51589
Residue:
502
  
Inhibitor
Name:
BDBM50017702
Synonyms:
1-(bis(4-fluorophenyl)methyl)-4-cinnamylpiperazine 1-[Bis-(4-fluoro-phenyl)-methyl]-4-(3-phenyl-allyl)-piperazine CHEMBL30008 Flunarizine cid_6365505
Type:
Small organic molecule
Emp. Form.:
C26H26F2N2
Mol. Mass.:
404.4948
SMILES:
Fc1ccc(cc1)C(N1CCN(C\C=C\c2ccccc2)CC1)c1ccc(F)cc1
: