Target
Microtubule-associated protein tau
Ligand
BDBM50103980
Substrate
Meas. Tech.
ChEMBL_1505258 (CHEMBL3594883)
Ki
48±n/a nM
Citation
 Chu, WZhou, DGaba, VLiu, JLi, SPeng, XXu, JDhavale, DBagchi, DPd'Avignon, AShakerdge, NBBacskai, BJTu, ZKotzbauer, PTMach, RH Design, Synthesis, and Characterization of 3-(Benzylidene)indolin-2-one Derivatives as Ligands fora-Synuclein Fibrils. J Med Chem 58:6002-17 (2015)  
Target
Name:
Microtubule-associated protein tau
Synonyms:
MAPT MTBT1 Neurofibrillary tangle protein Paired helical filament-tau TAU_HUMAN | Tau Protein
Type:
Protein
Mol. Mass.:
78928.63
Organism:
Homo sapiens (Human)
Description:
P10636
Residue:
758
  
Inhibitor
Name:
BDBM50103980
Synonyms:
CHEMBL3593905
Type:
Small organic molecule
Emp. Form.:
C19H18N2O2
Mol. Mass.:
306.3584
SMILES:
CN(C)c1ccc(\C=C\C=C2/C(=O)Nc3ccc(O)cc23)cc1
: