Target
Translocator protein
Ligand
BDBM50104787
Substrate
Meas. Tech.
ChEMBL_1508094 (CHEMBL3599695)
Ki
20±n/a nM
Citation
 Barresi, EBruno, ATaliani, SCosconati, SDa Pozzo, ESalerno, SSimorini, FDaniele, SGiacomelli, CMarini, AMLa Motta, CMarinelli, LCosimelli, BNovellino, EGreco, GDa Settimo, FMartini, C Deepening the Topology of the Translocator Protein Binding Site by Novel N,N-Dialkyl-2-arylindol-3-ylglyoxylamides. J Med Chem 58:6081-92 (2015)  
Target
Name:
Translocator protein
Synonyms:
Benzodiazepine receptors; peripheral & central Mbr PBR Peripheral benzodiazepine receptor (PBR) TSPO_RAT | Tspo
Type:
Mitochondrion membrane protein
Mol. Mass.:
18945.84
Organism:
Rattus norvegicus (rat)
Description:
Competitive binding experiments were performed on rat kidney mitochondrial membranes.
Residue:
169
  
Inhibitor
Name:
BDBM50104787
Synonyms:
CHEMBL3597366
Type:
Small organic molecule
Emp. Form.:
C25H30N2O3
Mol. Mass.:
406.5173
SMILES:
CCCCN(CCCC)C(=O)C(=O)c1c([nH]c2ccccc12)-c1ccc(OC)cc1
: