Target
5-hydroxytryptamine receptor 2A
Ligand
BDBM50104922
Substrate
Meas. Tech.
ChEMBL_1506484 (CHEMBL3599950)
Ki
1.7±n/a nM
Citation
 Boateng, CABakare, OMZhan, JBanala, AKBurzynski, CPommier, EKeck, TMDonthamsetti, PJavitch, JARais, RSlusher, BSXi, ZXNewman, AH High Affinity Dopamine D3 Receptor (D3R)-Selective Antagonists Attenuate Heroin Self-Administration in Wild-Type but not D3R Knockout Mice. J Med Chem 58:6195-213 (2015)  
Target
Name:
5-hydroxytryptamine receptor 2A
Synonyms:
5-HT-2 5-HT2A 5-hydroxytryptamine receptor 2A (5HT-2A) 5HT2A_HUMAN HTR2A | Serotonin receptor 2A
Type:
undefined
Mol. Mass.:
52607.65
Organism:
Homo sapiens (Human)
Description:
P28223
Residue:
471
  
Inhibitor
Name:
BDBM50104922
Synonyms:
CHEMBL3597637
Type:
Small organic molecule
Emp. Form.:
C25H29ClN4O2
Mol. Mass.:
452.976
SMILES:
COc1c(Cl)cccc1N1CCN(CCCCNC(=O)c2cnc3ccccc3c2)CC1
: