Target
D(2) dopamine receptor
Ligand
BDBM50104922
Substrate
Meas. Tech.
ChEMBL_1506479 (CHEMBL3599945)
IC50
63±n/a nM
Citation
 Boateng, CABakare, OMZhan, JBanala, AKBurzynski, CPommier, EKeck, TMDonthamsetti, PJavitch, JARais, RSlusher, BSXi, ZXNewman, AH High Affinity Dopamine D3 Receptor (D3R)-Selective Antagonists Attenuate Heroin Self-Administration in Wild-Type but not D3R Knockout Mice. J Med Chem 58:6195-213 (2015)  
Target
Name:
D(2) dopamine receptor
Synonyms:
D(2) dopamine receptor DOPAMINE D2 Long DRD2 Dopamine D2 receptor Dopamine D2 receptor (D2R) Dopamine2-like | d2
Type:
Cell-surface receptors
Mol. Mass.:
50647.10
Organism:
Homo sapiens (Human)
Description:
P14416
Residue:
443
  
Inhibitor
Name:
BDBM50104922
Synonyms:
CHEMBL3597637
Type:
Small organic molecule
Emp. Form.:
C25H29ClN4O2
Mol. Mass.:
452.976
SMILES:
COc1c(Cl)cccc1N1CCN(CCCCNC(=O)c2cnc3ccccc3c2)CC1
: