Target
D(3) dopamine receptor
Ligand
BDBM50104922
Substrate
Meas. Tech.
ChEMBL_1506480 (CHEMBL3599946)
EC50
16±n/a nM
Citation
 Boateng, CABakare, OMZhan, JBanala, AKBurzynski, CPommier, EKeck, TMDonthamsetti, PJavitch, JARais, RSlusher, BSXi, ZXNewman, AH High Affinity Dopamine D3 Receptor (D3R)-Selective Antagonists Attenuate Heroin Self-Administration in Wild-Type but not D3R Knockout Mice. J Med Chem 58:6195-213 (2015)  
Target
Name:
D(3) dopamine receptor
Synonyms:
DOPAMINE D3 DRD3_HUMAN Dopamine D3 receptor (D3) Dopamine receptor Dopamine receptor D3
Type:
Mol. Mass.:
44243.43
Organism:
Homo sapiens (Human)
Description:
Residue:
400
  
Inhibitor
Name:
BDBM50104922
Synonyms:
CHEMBL3597637
Type:
Small organic molecule
Emp. Form.:
C25H29ClN4O2
Mol. Mass.:
452.976
SMILES:
COc1c(Cl)cccc1N1CCN(CCCCNC(=O)c2cnc3ccccc3c2)CC1
: