Target
Histone deacetylase 3
Ligand
BDBM25150
Substrate
Meas. Tech.
ChEMBL_1506755 (CHEMBL3598914)
Ki
1.5±n/a nM
Citation
 Carrillo, AKGuiguemde, WAGuy, RK Evaluation of histone deacetylase inhibitors (HDACi) as therapeutic leads for human African trypanosomiasis (HAT). Bioorg Med Chem 23:5151-5 (2015)  
Target
Name:
Histone deacetylase 3
Synonyms:
HD3 HDAC3_HUMAN Human HDAC3 SMAP45
Type:
Enzyme
Mol. Mass.:
48829.55
Organism:
Homo sapiens (Human)
Description:
O15379
Residue:
428
  
Inhibitor
Name:
BDBM25150
Synonyms:
(2E)-N-hydroxy-3-[3-(phenylsulfamoyl)phenyl]prop-2-enamide Belinostat PXD101
Type:
Small organic molecule
Emp. Form.:
C15H14N2O4S
Mol. Mass.:
318.348
SMILES:
ONC(=O)\C=C\c1cccc(c1)S(=O)(=O)Nc1ccccc1
: