Target
Histone deacetylase 7
Ligand
BDBM19428
Substrate
Meas. Tech.
ChEMBL_1506759 (CHEMBL3598918)
Ki
9500±n/a nM
Citation
 Carrillo, AKGuiguemde, WAGuy, RK Evaluation of histone deacetylase inhibitors (HDACi) as therapeutic leads for human African trypanosomiasis (HAT). Bioorg Med Chem 23:5151-5 (2015)  
Target
Name:
Histone deacetylase 7
Synonyms:
HD7 HDAC7A Histone acetylase 7 (HDAC7) Human HDAC7
Type:
Chromatin regulator; hydrolase; repressor
Mol. Mass.:
102942.62
Organism:
Homo sapiens (Human)
Description:
Q8WUI4
Residue:
952
  
Inhibitor
Name:
BDBM19428
Synonyms:
(2E)-N-hydroxy-3-(4-{[(2-hydroxyethyl)[2-(1H-indol-3-yl)ethyl]amino]methyl}phenyl)prop-2-enamide CHEMBL356066 LAQ-824 | NVP-LAQ824
Type:
Small organic molecule
Emp. Form.:
C22H25N3O3
Mol. Mass.:
379.4522
SMILES:
OCCN(CCc1c[nH]c2ccccc12)Cc1ccc(\C=C\C(=O)NO)cc1
: