Target
Carbonic anhydrase 2
Ligand
BDBM26189
Substrate
Meas. Tech.
ChEMBL_1508534 (CHEMBL3602570)
Ki
7700±n/a nM
Citation
 Güney, MÇavdar, HSentürk, MEkinci, D Synthesis and carbonic anhydrase inhibitory properties of novel uracil derivatives. Bioorg Med Chem Lett 25:3261-3 (2015)  
Target
Name:
Carbonic anhydrase 2
Synonyms:
CA-II CAC Carbonate dehydratase II Carbonic anhydrase 2 (CA-II) Carbonic anhydrase C Carbonic anhydrase II (CA-II) Carbonic anhydrase II (hCA II) | Carbonic anhydrase isoenzyme II (hCA II)
Type:
Enzyme
Mol. Mass.:
29250.71
Organism:
Homo sapiens (Human)
Description:
P00918
Residue:
260
  
Inhibitor
Name:
BDBM26189
Synonyms:
α-CA inhibitor, 13 1,3-dihydroxybenzene US9688816, 4 phenol derivative, 3
Type:
Small organic molecule
Emp. Form.:
C6H6O2
Mol. Mass.:
110.1106
SMILES:
Oc1cccc(O)c1
: