Target
Potassium voltage-gated channel subfamily H member 2
Ligand
BDBM50106523
Substrate
Meas. Tech.
ChEMBL_1508617 (CHEMBL3602728)
IC50
>10000±n/a nM
Citation
 Roth, GJHeckel, AKley, JTLehmann, TMüller, SGOost, TRudolf, KArndt, KBudzinski, RLenter, MLotz, RRSchindler, MThomas, LStenkamp, D Design, synthesis and evaluation of MCH receptor 1 antagonists--Part II: Optimization of pyridazines toward reduced phospholipidosis and hERG inhibition. Bioorg Med Chem Lett 25:3270-4 (2015)  
Target
Name:
Potassium voltage-gated channel subfamily H member 2
Synonyms:
1,3-beta-glucan synthase component GLS2 ERG Eag-related protein 1 Ether-a-go-go-related gene (HERG) Ether-a-go-go-related gene potassium channel 1 Ether-a-go-go-related gene potassium channel 1 (hERG1) Ether-a-go-go-related protein 1 H-ERG KCNH2 Potassium voltage-gated channel subfamily H member 2 (hERG) Voltage-gated potassium channel subunit Kv11.1 hERG Potassium Channel 1 | putative potassium channel subunit
Type:
Multi-pass membrane protein
Mol. Mass.:
126672.65
Organism:
Homo sapiens (Human)
Description:
Q12809
Residue:
1159
  
Inhibitor
Name:
BDBM50106523
Synonyms:
CHEMBL3601038
Type:
Small organic molecule
Emp. Form.:
C27H33N5O2
Mol. Mass.:
459.5832
SMILES:
CC(=O)NC1CCN(Cc2ccc(NCCCc3ccc(Oc4ccccc4)nn3)cc2)CC1
: