Target
P2X purinoceptor 7
Ligand
BDBM50404070
Substrate
Meas. Tech.
ChEMBL_1509068 (CHEMBL3602551)
IC50
>100000±n/a nM
Citation
 Caseley, EAMuench, SPBaldwin, SASimmons, KFishwick, CWJiang, LH Docking of competitive inhibitors to the P2X7 receptor family reveals key differences responsible for changes in response between rat and human. Bioorg Med Chem Lett 25:3164-7 (2015)  
Target
Name:
P2X purinoceptor 7
Synonyms:
ATP receptor P2X purinoceptor 7 P2X purinoceptor 7 (P2X7) P2X7 rat P2rx7 | Purinergic receptor
Type:
Protein
Mol. Mass.:
68403.50
Organism:
Rattus norvegicus (Rat)
Description:
Q64663
Residue:
595
  
Inhibitor
Name:
BDBM50404070
Synonyms:
CHEMBL338117
Type:
Small organic molecule
Emp. Form.:
C24H21N3O5S
Mol. Mass.:
463.506
SMILES:
Oc1csc(=O)n1C(CCc1ccncc1)COc1ccc(cc1)-c1cccc(c1)[N+]([O-])=O
: