Target
P2X purinoceptor 7
Ligand
BDBM50404070
Substrate
Meas. Tech.
ChEMBL_1509067 (CHEMBL3602550)
IC50
31±n/a nM
Citation
 Caseley, EAMuench, SPBaldwin, SASimmons, KFishwick, CWJiang, LH Docking of competitive inhibitors to the P2X7 receptor family reveals key differences responsible for changes in response between rat and human. Bioorg Med Chem Lett 25:3164-7 (2015)  
Target
Name:
P2X purinoceptor 7
Synonyms:
ATP receptor P2RX7_HUMAN P2X purinoceptor 7 (P2X7) P2Z receptor | Purinergic receptor
Type:
Protein
Mol. Mass.:
68602.85
Organism:
Homo sapiens (Human)
Description:
Q99572
Residue:
595
  
Inhibitor
Name:
BDBM50404070
Synonyms:
CHEMBL338117
Type:
Small organic molecule
Emp. Form.:
C24H21N3O5S
Mol. Mass.:
463.506
SMILES:
Oc1csc(=O)n1C(CCc1ccncc1)COc1ccc(cc1)-c1cccc(c1)[N+]([O-])=O
: